Bibliographic references
type: Ontology
creator: Nick Knouf <nknouf@mit.edu>
contributor: Antoine Zimmermann <antoine.zimmermann@inrialpes.fr>
contributor: Jérôme Euzenat
description: Bibliographic references in OWL
date: 08/06/2005
comment: Possible ontology to describe bibTeX entries.
version info: $Id: onto.rdf,v 1.30 2008/05/27 14:41:13 euzenat Exp $

Référence
type: Class
comment: Base class for all entries @en
subclass of: Restriction
  on property: date
  max cardinality: 1
subclass of: Restriction
  on property: titre
  max cardinality: 1
subclass of: Restriction
  on property: human creator
  max cardinality: 1

Article
type: Class
subclass of: Partie
comment: An article from a journal or magazine. @en
subclass of: Restriction
  on property: auteurs
  cardinality: 1
subclass of: Restriction
  on property: pages
  cardinality: 1
subclass of: Restriction
  on property: journal
  cardinality: 1
subclass of: Restriction
  on property: date
  cardinality: 1
subclass of: Restriction
  on property: date
  all values from: Date
subclass of: Restriction
  on property: numéro
  max cardinality: 1
subclass of: Restriction
  on property: volume
  max cardinality: 1

Livre
type: Class
subclass of: Référence
comment: A book that may be a monograph or a collection of written texts. @en
subclass of: Restriction
  on property: titre
  cardinality: 1
subclass of: Restriction
  on property: volume
  max cardinality: 1
subclass of: Restriction
  on property: éditeur
  max cardinality: 1
subclass of: Restriction
  on property: série
  max cardinality: 1
subclass of: Restriction
  on property: date
  cardinality: 1
subclass of: Restriction
  on property: date
  all values from: Date
subclass of: Restriction
  on property: auteurs
  cardinality: 1
subclass of: Restriction
  on property: édition
  max cardinality: 1

Monographie
type: Class
subclass of: Livre
comment: A book that is a single entity, as opposed to a collection. @en
subclass of: Restriction
  on property: chapitres
  all values from: BookPart

Compilation
type: Class
subclass of: Livre
comment: A book that is collection of texts or articles. @en
subclass of: Restriction
  on property: chapitres
  all values from: BookPart
subclass of: Restriction
  on property: parties
  all values from: Incollection

Informel
type: Class
subclass of: Référence
comment: A document that was informally published or not published. @en
subclass of: Restriction
  on property: titre
  cardinality: 1

Livret
type: Class
subclass of: Informel
comment: A work that is printed and bound, but without a named publisher or sponsoring institution. @en

Partie
type: Class
subclass of: Référence
comment: A part of something (either Book or Proceedings). @en
subclass of: Restriction
  on property: pages
  max cardinality: 1
subclass of: Restriction
  on property: titre
  cardinality: 1

BookPart
type: Class
subclass of: Partie
comment: A chapter (or section or whatever) of a book having its own title. @en
subclass of: Restriction
  on property: chapitre
  max cardinality: 1
subclass of: Restriction
  on property: chapitre
  max cardinality: 1

ExtraitLivre
type: Class
subclass of: Partie
comment: A subpart of a book given by a range of pages. @en
subclass of: Restriction
  on property: auteurs
  cardinality: 1
subclass of: Restriction
  on property: pages
  min cardinality: 1
subclass of: Restriction
  on property: livre
  cardinality: 1

Incollection
type: Class
subclass of: Partie
comment: A part of a book having its own title. @en
subclass of: Restriction
  on property: auteurs
  cardinality: 1
subclass of: Restriction
  on property: collection
  cardinality: 1

ExtraitActes
type: Class
subclass of: Partie
comment: An article in a conference proceedings. @en
subclass of: Restriction
  on property: auteurs
  cardinality: 1
subclass of: Restriction
  on property: actes
  cardinality: 1

Polycopié
type: Class
subclass of: Informel
comment: Lecture notes. @en

Manuel
type: Class
subclass of: Informel
comment: Technical documentation. @en
subclass of: Restriction
  on property: organisation
  max cardinality: 1
subclass of: Restriction
  on property: édition
  max cardinality: 1
subclass of: Restriction
  on property: titre
  cardinality: 1

Mémoire
type: Class
subclass of: Référence
comment: A Master's or PhD thesis. @en
subclass of: Restriction
  on property: auteurs
  cardinality: 1
subclass of: Restriction
  on property: titre
  cardinality: 1
subclass of: Restriction
  on property: institution
  cardinality: 1
subclass of: Restriction
  on property: date
  cardinality: 1

MémoireDeMastère
type: Class
subclass of: Mémoire
comment: A Master's thesis. @en

MémoireDeDoctorat
type: Class
subclass of: Mémoire
comment: A PhD thesis. @en

Divers
type: Class
subclass of: Référence
comment: Use this type when nothing else fits. @en

Actes
type: Class
subclass of: Livre
comment: The proceedings of a conference. @en
comment: A proceedings may be implicitly defined with an inproceedings. @en
subclass of: Restriction
  on property: communications
  all values from: ExtraitActes
subclass of: Restriction
  on property: évènement
  max cardinality: 1
subclass of: Restriction
  on property: évènement
  all values from: The location of an event
subclass of: Restriction
  on property: éditeurs
  max cardinality: 1
subclass of: Restriction
  on property: organisation
  max cardinality: 1

Raport
type: Class
subclass of: Référence
comment: A report published by an institution with some explicit policy. @en
subclass of: Restriction
  on property: auteurs
  cardinality: 1
subclass of: Restriction
  on property: titre
  cardinality: 1
subclass of: Restriction
  on property: institution
  cardinality: 1
subclass of: Restriction
  on property: date
  cardinality: 1
subclass of: Restriction
  on property: date
  all values from: Date
subclass of: Restriction
  on property: numéro
  max cardinality: 1

RaportTechnique
type: Class
subclass of: Raport
comment: A report published by a school or other institution, usually numbered within a series. @en

Deliverable report
type: Class
subclass of: Raport
comment: A report delivered for accomplishing a contract. @en
subclass of: Restriction
  on property: Contract
  max cardinality: 1

NonPublié
type: Class
subclass of: Informel
comment: A document having an author and title, but not formally published. @en
subclass of: Restriction
  on property: auteurs
  cardinality: 1
subclass of: Restriction
  on property: titre
  cardinality: 1
subclass of: Restriction
  on property: note
  min cardinality: 1

Film
type: Class
subclass of: Référence
comment: A film/movie/motion picture. @en

Journal or magazine
type: Class
comment: A periodical publication collecting works from different authors. @en
subclass of: Restriction
  on property: The name of an entity.
  cardinality: 1
subclass of: Restriction
  on property: The name of an entity.
  all values from: string
subclass of: Restriction
  on property: The name of an entity.
  all values from: string
subclass of: Restriction
  on property: Periodicity
  all values from: string
subclass of: Restriction
  on property: éditeur
  max cardinality: 1
subclass of: Restriction
  on property: série
  max cardinality: 1
subclass of: Restriction
  on property: First published
  max cardinality: 1
subclass of: Restriction
  on property: articles
  all values from: Article

The location of an event
type: Class
comment: An event presenting work. @en
subclass of: Restriction
  on property: The name of an entity.
  cardinality: 1
subclass of: Restriction
  on property: organisateur
  all values from: Institution
subclass of: Restriction
  on property: The name of an entity.
  max cardinality: 1
subclass of: Restriction
  on property: Issue
  max cardinality: 1
subclass of: Restriction
  on property: localisation
  max cardinality: 1

Adresse
type: Class
comment: The street address of the location of some organization or event. @en
subclass of: Restriction
  on property: pays
  max cardinality: 1
subclass of: Restriction
  on property: pays
  all values from: string
subclass of: Restriction
  on property: état
  max cardinality: 1
subclass of: Restriction
  on property: état
  all values from: string
subclass of: Restriction
  on property: ville
  max cardinality: 1
subclass of: Restriction
  on property: ville
  all values from: string

Institution
type: Class
subclass of: Organization
comment: An institution. @en
subclass of: Restriction
  on property: The name of an entity.
  cardinality: 1
subclass of: Restriction
  on property: The name of an entity.
  cardinality: 1
subclass of: Restriction
  on property: adresse
  max cardinality: 1

Éditeur
type: Class
subclass of: Institution
comment: The publisher of books or journals. @en

Université
type: Class
subclass of: Institution
comment: A school or university. @en

Person list
type: Class
subclass of: List
comment: A list of persons. @en
subclass of: Restriction
  on property: first
  cardinality: 1
subclass of: Restriction
  on property: first
  all values from: Person
subclass of: Restriction
  on property: rest
  cardinality: 1
subclass of: Restriction
  on property: rest
  all values from: Class
    union of: Person list
    union of: Class
      one of: nil

IntervalleDePages
type: Class
comment: A range of pages. @en
subclass of: Restriction
  on property: start page
  cardinality: 1
subclass of: Restriction
  on property: end page
  cardinality: 1

Date
type: Class
comment: Date of a day which can be unknown (i.e., only the year is known or only the year and month). This is for overcoming the limits of XML-Schema for wich a date is not separable. @en
subclass of: Restriction
  on property: année
  cardinality: 1
subclass of: Restriction
  on property: année
  all values from: gYear
subclass of: Restriction
  on property: mois
  max cardinality: 1
subclass of: Restriction
  on property: mois
  all values from: gMonth
subclass of: Restriction
  on property: jour
  max cardinality: 1
subclass of: Restriction
  on property: jour
  all values from: gDay

Clé
type: DatatypeProperty
domain: Référence
range: string
comment: The key for a particular entry. Note that the rdf:ID for each Reference instance could be the key as well, possibly making this property redundant. @en

howReviewed
type: DatatypeProperty
domain: Référence
range: string
comment: The selection process overcome by the publication (full, none, poster, invited are possible values). @en

chapitres
type: ObjectProperty
domain: Référence
range: BookPart
comment: The chapters of a book (monograph or collection). @en

parties
type: ObjectProperty
domain: Référence
range: Partie
comment: The parts of some reference (chapters, sections). @en

communications
type: ObjectProperty
domain: Actes
range: ExtraitActes
comment: The communications to a conference as collected in proceedings. @en

articles
type: ObjectProperty
domain: Journal or magazine
range: Article
comment: The papers published by a journal. @en

adresse
type: ObjectProperty
domain: Thing
range: Adresse
comment: The address of an institution or the place of a conference. @en

évènement
type: ObjectProperty
domain: Actes
range: The location of an event
comment: The event concerned with the proceedings. @en

organisateur
type: ObjectProperty
domain: The location of an event
range: Organization
comment: The organization taking in charge a conference. @en

annote
type: DatatypeProperty
domain: Référence
range: string
comment: An annotation. It is not used by the standard bibliography styles, but may be used by others that produce an annotated bibliography. @en

Periodicity
type: DatatypeProperty
domain: Journal or magazine
range: string
comment: The periodicity of a serial publication (yearly, biannual, quarterly, monthly, bimonthly, weekly, biweekly, dayly). @en

Contract
type: ObjectProperty
domain: Référence
range: Thing
comment: The contract in relation of which a particular reference has been made. @en

First published
type: DatatypeProperty
domain: BookPart
range: string
comment: When the reference was first published. @en

édition
type: DatatypeProperty
domain: Class
  union of: Livre
  union of: Manuel
range: string
comment: The edition of a book (for example, "Second"). This should be an ordinal. @en

human creator
type: ObjectProperty
domain: Référence
range: Person list
comment: The list of the human creators of a work. @en

auteurs
type: ObjectProperty
sub property of: human creator
comment: The list of the author(s) of a work. @en

éditeurs
type: ObjectProperty
sub property of: human creator
comment: The list of persons who edited or coordinated a work. @en

réalisateurs
type: ObjectProperty
sub property of: human creator
domain: Film
comment: The list of directors of a motion picture or theater play. @en

published
type: DatatypeProperty
domain: Class
  union of: Divers
  union of: Livret
range: string
comment: How something strange has been published. @en

institution
type: ObjectProperty
domain: Raport
range: Institution
comment: The sponsoring institution of a technical report. @en
domain: Class
  union of: Mémoire
  union of: Polycopié
range: Université
comment: The name of the school where a thesis was written. @en

is part of
type: ObjectProperty
domain: Partie
type: TransitiveProperty
comment: The document that contains a text or article. @en

journal
type: ObjectProperty
domain: Article
range: Journal or magazine
sub property of: is part of
comment: The journal in which an article is published. @en

livre
type: ObjectProperty
domain: ExtraitLivre
range: Monographie
sub property of: is part of
comment: A reference to the book that contains the entry. @en

collection
type: ObjectProperty
domain: Incollection
range: Compilation
sub property of: is part of
comment: A reference to the book that contains the entry. @en

actes
type: ObjectProperty
domain: ExtraitActes
range: Actes
sub property of: is part of
comment: A reference to the proceedings in which the entry appears. @en

date
type: ObjectProperty
domain: Class
  union of: Référence
  union of: The location of an event
range: Date
comment: The date when the work was published or, for an unpublished work, in which it was written. This date can be incomplete (i.e., no known day or month) but must contain a year. @en

note
type: DatatypeProperty
domain: Référence
range: string
comment: Any additional information that can help the reader. @en

organisation
type: ObjectProperty
domain: Class
  union of: Actes
  union of: Manuel
range: Organization
comment: The organization that sponsors a conference or that publishes a manual. @en

éditeur
type: ObjectProperty
domain: Class
  union of: Référence
  union of: Journal or magazine
range: Éditeur
comment: The publisher of a work. @en

série
type: DatatypeProperty
domain: Référence
range: string
comment: The name of a series or set of books. When citing an entire book, the the title field gives its title and an optional series field gives the name of a series or multi-volume set in which the book is published. @en

titre
type: DatatypeProperty
domain: Référence
range: string
comment: The title of the work. @en

catégorie
type: DatatypeProperty
domain: Class
  union of: BookPart
  union of: RaportTechnique
  union of: Mémoire
range: string
comment: The type of a technical report (for example, "Research Note"). @en

affiliation
type: DatatypeProperty
domain: Référence
range: string
comment: The authors affiliation. @en

résumé
type: DatatypeProperty
domain: Référence
range: string
comment: The abstract of the work. @en

ontents
type: DatatypeProperty
domain: Référence
range: string
comment: The Table of Contents. @en

droits
type: DatatypeProperty
domain: Référence
range: string
comment: The Copyright information. @en

ISBN
type: DatatypeProperty
domain: Référence
range: string
comment: The International Standard Book Number. @en

ISSN
type: DatatypeProperty
domain: Référence
range: string
comment: The International Standard Serial Number. Used to identify a journal. @en

mots-clé
type: DatatypeProperty
domain: Référence
range: string
comment: Key words used for searching or possibly for annotation (as given by the author or publisher). @en

langage
type: DatatypeProperty
domain: Référence
range: language
comment: The language in which the referenced publication is written or performed (use ISO two-letter codes). @en

localisation
type: ObjectProperty
domain: Class
  union of: Référence
  union of: The location of an event
range: Adresse
comment: A location associated with the entry, such as the city in which a conference took place (this is now obsolete). @en

LCCN
type: DatatypeProperty
domain: Référence
range: string
comment: The Library of Congress Call Number (this the Congress of the United State of America). @en

MR number
type: DatatypeProperty
domain: Référence
range: string
comment: The Mathematical Reviews number. @en

prix
type: DatatypeProperty
domain: Référence
range: string
comment: The price of the document. @en

taille
type: DatatypeProperty
domain: Référence
range: string
comment: The physical dimensions of a document. @en

URL
type: DatatypeProperty
domain: Référence
range: string
comment: The Universal Resource Locator that points to the item being referenced. @en

The name of an entity.
type: DatatypeProperty
range: string

The name of an entity.
type: DatatypeProperty
range: string

chapitre
type: DatatypeProperty
domain: Partie
range: string
comment: The chapter (or section or whatever) number in which the entry is found. @en

pages
type: ObjectProperty
domain: Partie
range: IntervalleDePages
comment: A range of page, with an upper and lower limit. @en

volume or number
type: DatatypeProperty
domain: Class
  union of: Référence
  union of: The location of an event
comment: The number of a journal, magazine, technical report, or of a work in a series. An issue of a journal or magazine is usually identified by its volume and number; the organization that issues a technical report usually gives it a number; and sometimes books are given numbers in a named series. @en

numéro
type: DatatypeProperty
domain: Référence
range: string
sub property of: volume or number
comment: The number of a journal, magazine, technical report, or of a work in a series. An issue of a journal or magazine is usually identified by its volume and number; the organization that issues a technical report usually gives it a number; and sometimes books are given numbers in a named series. @en

Issue
type: DatatypeProperty
domain: Class
  union of: Référence
  union of: The location of an event
range: string
sub property of: volume or number
comment: The issue of a conference. @en

volume
type: DatatypeProperty
sub property of: volume or number
domain: Référence
range: nonNegativeInteger
comment: The volume of a journal or multivolume book. @en

année
type: DatatypeProperty
domain: Date
range: gYear

mois
type: DatatypeProperty
domain: Date
range: gMonth

jour
type: DatatypeProperty
domain: Date
range: gDay

ville
type: DatatypeProperty
domain: Adresse
range: string

état
type: DatatypeProperty
domain: Adresse
range: string

pays
type: DatatypeProperty
domain: Adresse
range: string
comment: Usually in ISO format @en

start page
type: DatatypeProperty
domain: IntervalleDePages
range: nonNegativeInteger
comment: The beginning of a range of pages. @en

end page
type: DatatypeProperty
domain: IntervalleDePages
range: nonNegativeInteger
comment: The end of a range of pages. @en

John-Jules Meyer
type: Person
first name: John-Jules
last name: Meyer

Jeen Broekstra
type: Person
first name: Jeen
last name: Broekstra

Alexander Mädche
type: Person
first name: Alexander
last name: Mädche

Björn Schnizler
type: Person
first name: Björn
last name: Schnizler

Alberto Trombetta
type: Person
first name: Alberto
last name: Trombetta

Christine Parent
type: Person
first name: Christine
last name: Parent

R. Schmidt
type: Person
first name: R.
last name: Schmidt

York Sure
type: Person
first name: York
last name: Sure

M. Punceva
type: Person
first name: M.
last name: Punceva

I. V. Levenshtein
type: Person
first name: I. V.
last name: Levenshtein

Steffen Staab
type: Person
first name: Steffen
last name: Staab

Frank Boer
type: Person
first name: Frank
last name: Boer

Maarten Menken
type: Person
first name: Maarten
last name: Menken

Manfred Hauswirth
type: Person
first name: Manfred
last name: Hauswirth

Wiebe Hoek
type: Person
first name: Wiebe
last name: Hoek

Marc Ehrig
type: Person
first name: Marc
last name: Ehrig

Danilo Montesi
type: Person
first name: Danilo
last name: Montesi

Rogier Eijk
type: Person
first name: Rogier
last name: Eijk

Frank van Harmelen
type: Person
first name: Frank
last name: van Harmelen

Philippe Cudré-Mauroux
type: Person
first name: Philippe
last name: Cudré-Mauroux

Z. Despotovic
type: Person
first name: Z.
last name: Despotovic

Stefano Spaccapietra
type: Person
first name: Stefano
last name: Spaccapietra

Mike Papazoglou
type: Person
first name: Mike
last name: Papazoglou

Zahir Tari
type: Person
first name: Zahir
last name: Tari

A. Datta
type: Person
first name: A.
last name: Datta

Ateret Anaby-Tavor
type: Person
first name: Ateret
last name: Anaby-Tavor

Ronny Siebes
type: Person
first name: Ronny
last name: Siebes

Karl Aberer
type: Person
first name: Karl
last name: Aberer

Peter Mika
type: Person
first name: Peter
last name: Mika

Peter Haase
type: Person
first name: Peter
last name: Haase

Avigdor Gal
type: Person
first name: Avigdor
last name: Gal

Journal of Web Semantics
type: Revue
nom court: JWS

Springer-Verlag
type: Éditeur
nom: Springer-Verlag
adresse: Adresse
  ville: Heidelberg
  pays: DE

Cybernetics and Control Theory
type: Revue
nom: Cybernetics and Control Theory

The MIT Press
type: Éditeur
nom: The MIT Press
adresse: Adresse
  ville: Cambridge
  état: MA
  pays: US

International journal of intelligent system
type: Revue
nom: International journal of intelligent system
nom court: IJIS

ACM SIGMOD Record
type: Revue
nom: ACM SIGMOD Record

VLDB Journal
type: Revue
nom: VLDB Journal

SemPGrid 04 Workshop
type: Conférence
nom: SemPGrid 04 Workshop
localisation: Adresse
  ville: New-York
  état: NY
  pays: US
date: Date
  mois: --05
  année: 2004

13th Int. Conference on Knowledge Engineering and Management (EKAW-2002)
type: Conférence
nom: Int. Conference on Knowledge Engineering and Management
nom court: EKAW
sortie: 13
date: Date
  mois: --10
  année: 2002

First European Semantic Web Symposium
type: Conférence
nom: European Semantic Web Symposium
nom court: ESWS
sortie: 1
localisation: Adresse
  ville: Heraklion
  pays: GR
date: Date
  mois: --05
  année: 2004

Proceedings of the SemPGrid 04 Workshop
type: Actes
titre: Proceedings of the SemPGrid 04 Workshop
date: Date
  année: 2004
évènement: SemPGrid 04 Workshop

Bibster - A Semantics-Based Bibliographic Peer-to-Peer System
type: ExtraitActes
auteurs: Jeen Broekstra
auteurs: Marc Ehrig
auteurs: Peter Haase
auteurs: Frank van Harmelen
auteurs: Maarten Menken
auteurs: Peter Mika
auteurs: Björn Schnizler
auteurs: Ronny Siebes
actes: Proceedings of the SemPGrid 04 Workshop
titre: Bibster - A Semantics-Based Bibliographic Peer-to-Peer System

Measuring Similarity between Ontologies
type: ExtraitActes
auteurs: Alexander Mädche
auteurs: Steffen Staab
actes: Proc. Of the 13th Int. Conference on Knowledge Engineering and Management (EKAW-2002)
titre: Measuring Similarity between Ontologies

{P-Grid: A Self-organizing Structured P2P System}
type: Article
auteurs: Karl Aberer
auteurs: Philippe Cudré-Mauroux
auteurs: A. Datta
auteurs: Z. Despotovic
auteurs: Manfred Hauswirth
auteurs: M. Punceva
auteurs: R. Schmidt
journal: ACM SIGMOD Record
titre: {P-Grid}: A Self-organizing Structured P2P System
date: Date
  année: 2003

Binary Codes capable of correcting deletions, insertions, and reversals
type: Article
auteurs: I. V. Levenshtein
journal: Cybernetics and Control Theory
titre: Binary Codes capable of correcting deletions, insertions, and reversals
date: Date
  année: 1996

Database integration: the key to data interoperability
type: ExtraitLivre
auteurs: Christine Parent
auteurs: Stefano Spaccapietra
livre: Object-Oriented Data Modeling
titre: Database integration: the key to data interoperability
éditeurs: Stefano Spaccapietra
éditeurs: Mike Papazoglou
éditeurs: Zahir Tari

Proc. Of the 13th Int. Conference on Knowledge Engineering and Management (EKAW-2002)
type: Actes
éditeur: Springer-Verlag
titre: Proc. Of the 13th Int. Conference on Knowledge Engineering and Management (EKAW-2002)
évènement: 13th Int. Conference on Knowledge Engineering and Management (EKAW-2002)
date: Date
  année: 2002

Proceedings of the First European Semantic Web Symposium
type: Actes
éditeur: Springer-Verlag
évènement: First European Semantic Web Symposium
titre: Proceedings of the First European Semantic Web Symposium
date: Date
  année: 2004

{QOM} - Quick Ontology Mapping
type: Divers
auteurs: Marc Ehrig
auteurs: Steffen Staab
titre: {QOM} - Quick Ontology Mapping
note: submitted to the ISWC 04
date: Date
  année: 2004

Ontology Mapping - An Integrated Approach
type: ExtraitActes
auteurs: Marc Ehrig
auteurs: York Sure
actes: Proceedings of the First European Semantic Web Symposium
titre: Ontology Mapping - An Integrated Approach
url: http://www.aifb.uni-karlsruhe.de/WBS/meh/publications/ehrig04ontology_ESWS04.pdf

Start making sense: The Chatty Web approach for global semantic agreements
type: Article
auteurs: Karl Aberer
auteurs: Philippe Cudré-Mauroux
auteurs: Manfred Hauswirth
journal: Journal of Web Semantics
titre: Start making sense: The Chatty Web approach for global semantic agreements
date: Date
  mois: --12
  année: 2003

Object-Oriented Data Modeling
type: Monographie
éditeur: The MIT Press
titre: Object-Oriented Data Modeling
date: Date
  année: 2000

On dynamically generated ontology translators in agent communication
type: Article
auteurs: Rogier Eijk
auteurs: Frank Boer
auteurs: Wiebe Hoek
auteurs: John-Jules Meyer
journal: International journal of intelligent system
titre: On dynamically generated ontology translators in agent communication
pages: IntervalleDePages
  page début: 587
  page fin: 607
date: Date
  mois: --12
  année: 2001

A Framework for Modeling and Evaluating Automatic Semantic Reconciliation
type: Article
auteurs: Avigdor Gal
auteurs: Ateret Anaby-Tavor
auteurs: Alberto Trombetta
auteurs: Danilo Montesi
journal: VLDB Journal
titre: A Framework for Modeling and Evaluating Automatic Semantic Reconciliation
note: to appear
date: Date
  année: 2004