Bibliographic references
type: Ontology
creator: Nick Knouf <nknouf@mit.edu>
contributor: Antoine Zimmermann <antoine.zimmermann@inrialpes.fr>
contributor: Jérôme Euzenat
description: Bibliographic references in OWL
date: 08/06/2005
comment: Possible ontology to describe bibTeX entries.
version info: $Id: onto.rdf,v 1.30 2008/05/27 14:41:13 euzenat Exp $

Entry
type: Class
comment: Base class for all entries
subclass of: Restriction
  on property: publishingDate
  max cardinality: 1
subclass of: Restriction
  on property: heading
  max cardinality: 1
subclass of: Restriction
  on property: human creator
  max cardinality: 1

JournalPaper
type: Class
subclass of: Section
comment: An article from a journal or magazine.
subclass of: Restriction
  on property: writtenBy
  cardinality: 1
subclass of: Restriction
  on property: pageRange
  cardinality: 1
subclass of: Restriction
  on property: inPeriodical
  cardinality: 1
subclass of: Restriction
  on property: publishingDate
  cardinality: 1
subclass of: Restriction
  on property: publishingDate
  all values from: Date
subclass of: Restriction
  on property: number
  max cardinality: 1
subclass of: Restriction
  on property: volume
  max cardinality: 1

Book
type: Class
subclass of: Entry
comment: A book that may be a monograph or a collection of written texts.
subclass of: Restriction
  on property: heading
  cardinality: 1
subclass of: Restriction
  on property: volume
  max cardinality: 1
subclass of: Restriction
  on property: publishedBy
  max cardinality: 1
subclass of: Restriction
  on property: inSeries
  max cardinality: 1
subclass of: Restriction
  on property: publishingDate
  cardinality: 1
subclass of: Restriction
  on property: publishingDate
  all values from: Date
subclass of: Restriction
  on property: writtenBy
  cardinality: 1
subclass of: Restriction
  on property: issue
  max cardinality: 1

Monography
type: Class
subclass of: Book
comment: A book that is a single entity, as opposed to a collection.
subclass of: Restriction
  on property: sections
  all values from: BookPart

Compilation
type: Class
subclass of: Book
comment: A book that is collection of texts or articles.
subclass of: Restriction
  on property: sections
  all values from: BookPart
subclass of: Restriction
  on property: tomes
  all values from: Incollection

NonFormal
type: Class
subclass of: Entry
comment: A document that was informally published or not published.
subclass of: Restriction
  on property: heading
  cardinality: 1

Brochure
type: Class
subclass of: NonFormal
comment: A work that is printed and bound, but without a named publisher or sponsoring institution.

Section
type: Class
subclass of: Entry
comment: A part of something (either Book or Proceedings).
subclass of: Restriction
  on property: pageRange
  max cardinality: 1
subclass of: Restriction
  on property: heading
  cardinality: 1

BookPart
type: Class
subclass of: Section
comment: A chapter (or section or whatever) of a book having its own title.
subclass of: Restriction
  on property: section
  max cardinality: 1
subclass of: Restriction
  on property: section
  max cardinality: 1

Extract
type: Class
subclass of: Section
comment: A subpart of a book given by a range of pages.
subclass of: Restriction
  on property: writtenBy
  cardinality: 1
subclass of: Restriction
  on property: pageRange
  min cardinality: 1
subclass of: Restriction
  on property: inVolume
  cardinality: 1

Incollection
type: Class
subclass of: Section
comment: A part of a book having its own title.
subclass of: Restriction
  on property: writtenBy
  cardinality: 1
subclass of: Restriction
  on property: inCompilation
  cardinality: 1

Communication
type: Class
subclass of: Section
comment: An article in a conference proceedings.
subclass of: Restriction
  on property: writtenBy
  cardinality: 1
subclass of: Restriction
  on property: inMinutes
  cardinality: 1

CourseMaterial
type: Class
subclass of: NonFormal
comment: Lecture notes.

ReferenceGuide
type: Class
subclass of: NonFormal
comment: Technical documentation.
subclass of: Restriction
  on property: sponsoredBy
  max cardinality: 1
subclass of: Restriction
  on property: issue
  max cardinality: 1
subclass of: Restriction
  on property: heading
  cardinality: 1

StudentReport
type: Class
subclass of: Entry
comment: A Master's or PhD thesis.
subclass of: Restriction
  on property: writtenBy
  cardinality: 1
subclass of: Restriction
  on property: heading
  cardinality: 1
subclass of: Restriction
  on property: issuer
  cardinality: 1
subclass of: Restriction
  on property: publishingDate
  cardinality: 1

MScThesis
type: Class
subclass of: StudentReport
comment: A Master's thesis.

DoctoralThesis
type: Class
subclass of: StudentReport
comment: A PhD thesis.

Various
type: Class
subclass of: Entry
comment: Use this type when nothing else fits.

ConferenceMinutes
type: Class
subclass of: Book
comment: The proceedings of a conference.
comment: A proceedings may be implicitly defined with an inproceedings.
subclass of: Restriction
  on property: talks
  all values from: Communication
subclass of: Restriction
  on property: meeting
  max cardinality: 1
subclass of: Restriction
  on property: meeting
  all values from: The location of an event
subclass of: Restriction
  on property: coordinatedBy
  max cardinality: 1
subclass of: Restriction
  on property: sponsoredBy
  max cardinality: 1

Report
type: Class
subclass of: Entry
comment: A report published by an institution with some explicit policy.
subclass of: Restriction
  on property: writtenBy
  cardinality: 1
subclass of: Restriction
  on property: heading
  cardinality: 1
subclass of: Restriction
  on property: issuedBy
  cardinality: 1
subclass of: Restriction
  on property: publishingDate
  cardinality: 1
subclass of: Restriction
  on property: publishingDate
  all values from: Date
subclass of: Restriction
  on property: number
  max cardinality: 1

TechnicalReport
type: Class
subclass of: Report
comment: A report published by a school or other institution, usually numbered within a series.

Deliverable report
type: Class
subclass of: Report
comment: A report delivered for accomplishing a contract.
subclass of: Restriction
  on property: Contract
  max cardinality: 1

Manuscript
type: Class
subclass of: NonFormal
comment: A document having an author and title, but not formally published.
subclass of: Restriction
  on property: writtenBy
  cardinality: 1
subclass of: Restriction
  on property: heading
  cardinality: 1
subclass of: Restriction
  on property: comment
  min cardinality: 1

Movie
type: Class
subclass of: Entry
comment: A film/movie/motion picture.

Journal or magazine
type: Class
comment: A periodical publication collecting works from different authors.
subclass of: Restriction
  on property: The name of an entity.
  cardinality: 1
subclass of: Restriction
  on property: The name of an entity.
  all values from: string
subclass of: Restriction
  on property: The name of an entity.
  all values from: string
subclass of: Restriction
  on property: Periodicity
  all values from: string
subclass of: Restriction
  on property: publishedBy
  max cardinality: 1
subclass of: Restriction
  on property: inSeries
  max cardinality: 1
subclass of: Restriction
  on property: First published
  max cardinality: 1
subclass of: Restriction
  on property: papers
  all values from: JournalPaper

The location of an event
type: Class
comment: An event presenting work.
subclass of: Restriction
  on property: The name of an entity.
  cardinality: 1
subclass of: Restriction
  on property: organizedBy
  all values from: Organization
subclass of: Restriction
  on property: The name of an entity.
  max cardinality: 1
subclass of: Restriction
  on property: issue
  max cardinality: 1
subclass of: Restriction
  on property: place
  max cardinality: 1

Directions
type: Class
comment: The street address of the location of some organization or event.
subclass of: Restriction
  on property: country
  max cardinality: 1
subclass of: Restriction
  on property: country
  all values from: string
subclass of: Restriction
  on property: state
  max cardinality: 1
subclass of: Restriction
  on property: state
  all values from: string
subclass of: Restriction
  on property: town
  max cardinality: 1
subclass of: Restriction
  on property: town
  all values from: string

Organization
type: Class
subclass of: Organization
comment: An institution.
subclass of: Restriction
  on property: The name of an entity.
  cardinality: 1
subclass of: Restriction
  on property: The name of an entity.
  cardinality: 1
subclass of: Restriction
  on property: coordinates
  max cardinality: 1

PublishingHouse
type: Class
subclass of: Organization
comment: The publisher of books or journals.

University
type: Class
subclass of: Organization
comment: A school or university.

Person list
type: Class
subclass of: List
comment: A list of persons.
subclass of: Restriction
  on property: first
  cardinality: 1
subclass of: Restriction
  on property: first
  all values from: Person
subclass of: Restriction
  on property: rest
  cardinality: 1
subclass of: Restriction
  on property: rest
  all values from: Class
    union of: Person list
    union of: Class
      one of: nil

PageInterval
type: Class
comment: A range of pages.
subclass of: Restriction
  on property: start page
  cardinality: 1
subclass of: Restriction
  on property: end page
  cardinality: 1

Date
type: Class
comment: Date of a day which can be unknown (i.e., only the year is known or only the year and month). This is for overcoming the limits of XML-Schema for wich a date is not separable.
subclass of: Restriction
  on property: year
  cardinality: 1
subclass of: Restriction
  on property: year
  all values from: gYear
subclass of: Restriction
  on property: month
  max cardinality: 1
subclass of: Restriction
  on property: month
  all values from: gMonth
subclass of: Restriction
  on property: day
  max cardinality: 1
subclass of: Restriction
  on property: day
  all values from: gDay

ref
type: DatatypeProperty
domain: Entry
range: string
comment: The key for a particular entry. Note that the rdf:ID for each Reference instance could be the key as well, possibly making this property redundant.

howReviewed
type: DatatypeProperty
domain: Entry
range: string
comment: The selection process overcome by the publication (full, none, poster, invited are possible values).

sections
type: ObjectProperty
domain: Entry
range: BookPart
comment: The chapters of a book (monograph or collection).

tomes
type: ObjectProperty
domain: Entry
range: Section
comment: The parts of some reference (chapters, sections).

talks
type: ObjectProperty
domain: ConferenceMinutes
range: Communication
comment: The communications to a conference as collected in proceedings.

papers
type: ObjectProperty
domain: Journal or magazine
range: JournalPaper
comment: The papers published by a journal.

coordinates
type: ObjectProperty
domain: Thing
range: Directions
comment: The address of an institution or the place of a conference.

meeting
type: ObjectProperty
domain: ConferenceMinutes
range: The location of an event
comment: The event concerned with the proceedings.

organizedBy
type: ObjectProperty
domain: The location of an event
range: Organization
comment: The organization taking in charge a conference.

annotation
type: DatatypeProperty
domain: Entry
range: string
comment: An annotation. It is not used by the standard bibliography styles, but may be used by others that produce an annotated bibliography.

Periodicity
type: DatatypeProperty
domain: Journal or magazine
range: string
comment: The periodicity of a serial publication (yearly, biannual, quarterly, monthly, bimonthly, weekly, biweekly, dayly).

Contract
type: ObjectProperty
domain: Entry
range: Thing
comment: The contract in relation of which a particular reference has been made.

First published
type: DatatypeProperty
domain: BookPart
range: string
comment: When the reference was first published.

issue
type: DatatypeProperty
domain: Class
  union of: Book
  union of: ReferenceGuide
range: string
comment: The edition of a book (for example, "Second"). This should be an ordinal.
domain: Class
  union of: Entry
  union of: The location of an event
sub property of: volume or number
label: Issue
comment: The issue of a conference.

human creator
type: ObjectProperty
domain: Entry
range: Person list
comment: The list of the human creators of a work.

writtenBy
type: ObjectProperty
sub property of: human creator
comment: The list of the author(s) of a work.

coordinatedBy
type: ObjectProperty
sub property of: human creator
comment: The list of persons who edited or coordinated a work.

directedBy
type: ObjectProperty
sub property of: human creator
domain: Movie
comment: The list of directors of a motion picture or theater play.

published
type: DatatypeProperty
domain: Class
  union of: Various
  union of: Brochure
range: string
comment: How something strange has been published.

issuedBy
type: ObjectProperty
domain: Report
range: Organization
comment: The sponsoring institution of a technical report.

is part of
type: ObjectProperty
domain: Section
type: TransitiveProperty
comment: The document that contains a text or article.

inPeriodical
type: ObjectProperty
domain: JournalPaper
range: Journal or magazine
sub property of: is part of
comment: The journal in which an article is published.

inVolume
type: ObjectProperty
domain: Extract
range: Monography
sub property of: is part of
comment: A reference to the book that contains the entry.

inCompilation
type: ObjectProperty
domain: Incollection
range: Compilation
sub property of: is part of
comment: A reference to the book that contains the entry.

inMinutes
type: ObjectProperty
domain: Communication
range: ConferenceMinutes
sub property of: is part of
comment: A reference to the proceedings in which the entry appears.

publishingDate
type: ObjectProperty
domain: Class
  union of: Entry
  union of: The location of an event
range: Date
comment: The date when the work was published or, for an unpublished work, in which it was written. This date can be incomplete (i.e., no known day or month) but must contain a year.

comment
type: DatatypeProperty
domain: Entry
range: string
comment: Any additional information that can help the reader.

sponsoredBy
type: ObjectProperty
domain: Class
  union of: ConferenceMinutes
  union of: ReferenceGuide
range: Organization
comment: The organization that sponsors a conference or that publishes a manual.

publishedBy
type: ObjectProperty
domain: Class
  union of: Entry
  union of: Journal or magazine
range: PublishingHouse
comment: The publisher of a work.

issuer
type: ObjectProperty
domain: Class
  union of: StudentReport
  union of: CourseMaterial
range: University
comment: The name of the school where a thesis was written.

inSeries
type: DatatypeProperty
domain: Entry
range: string
comment: The name of a series or set of books. When citing an entire book, the the title field gives its title and an optional series field gives the name of a series or multi-volume set in which the book is published.

heading
type: DatatypeProperty
domain: Entry
range: string
comment: The title of the work.

type
type: DatatypeProperty
domain: Class
  union of: BookPart
  union of: TechnicalReport
  union of: StudentReport
range: string
comment: The type of a technical report (for example, "Research Note").

company
type: DatatypeProperty
domain: Entry
range: string
comment: The authors affiliation.

summary
type: DatatypeProperty
domain: Entry
range: string
comment: The abstract of the work.

ontents
type: DatatypeProperty
domain: Entry
range: string
comment: The Table of Contents.

rights
type: DatatypeProperty
domain: Entry
range: string
comment: The Copyright information.

ISBN
type: DatatypeProperty
domain: Entry
range: string
comment: The International Standard Book Number.

ISSN
type: DatatypeProperty
domain: Entry
range: string
comment: The International Standard Serial Number. Used to identify a journal.

KeyWordsAndPhrases
type: DatatypeProperty
domain: Entry
range: string
comment: Key words used for searching or possibly for annotation (as given by the author or publisher).

idiom
type: DatatypeProperty
domain: Entry
range: language
comment: The language in which the referenced publication is written or performed (use ISO two-letter codes).

place
type: ObjectProperty
domain: Class
  union of: Entry
  union of: The location of an event
range: Directions
comment: A location associated with the entry, such as the city in which a conference took place (this is now obsolete).

LCCN
type: DatatypeProperty
domain: Entry
range: string
comment: The Library of Congress Call Number (this the Congress of the United State of America).

MR number
type: DatatypeProperty
domain: Entry
range: string
comment: The Mathematical Reviews number.

amount
type: DatatypeProperty
domain: Entry
range: string
comment: The price of the document.

dimensions
type: DatatypeProperty
domain: Entry
range: string
comment: The physical dimensions of a document.

URL
type: DatatypeProperty
domain: Entry
range: string
comment: The Universal Resource Locator that points to the item being referenced.

The name of an entity.
type: DatatypeProperty
range: string

The name of an entity.
type: DatatypeProperty
range: string

section
type: DatatypeProperty
domain: Section
range: string
comment: The chapter (or section or whatever) number in which the entry is found.

pageRange
type: ObjectProperty
domain: Section
range: PageInterval
comment: A range of page, with an upper and lower limit.

volume or number
type: DatatypeProperty
domain: Class
  union of: Entry
  union of: The location of an event
comment: The number of a journal, magazine, technical report, or of a work in a series. An issue of a journal or magazine is usually identified by its volume and number; the organization that issues a technical report usually gives it a number; and sometimes books are given numbers in a named series.

number
type: DatatypeProperty
domain: Entry
range: string
sub property of: volume or number
comment: The number of a journal, magazine, technical report, or of a work in a series. An issue of a journal or magazine is usually identified by its volume and number; the organization that issues a technical report usually gives it a number; and sometimes books are given numbers in a named series.

volume
type: DatatypeProperty
sub property of: volume or number
domain: Entry
range: nonNegativeInteger
comment: The volume of a journal or multivolume book.

year
type: DatatypeProperty
domain: Date
range: gYear

month
type: DatatypeProperty
domain: Date
range: gMonth

day
type: DatatypeProperty
domain: Date
range: gDay

town
type: DatatypeProperty
domain: Directions
range: string

state
type: DatatypeProperty
domain: Directions
range: string

country
type: DatatypeProperty
domain: Directions
range: string
comment: Usually in ISO format

start page
type: DatatypeProperty
domain: PageInterval
range: nonNegativeInteger
comment: The beginning of a range of pages.

end page
type: DatatypeProperty
domain: PageInterval
range: nonNegativeInteger
comment: The end of a range of pages.

John-Jules Meyer
type: Person
first name: John-Jules
last name: Meyer

Jeen Broekstra
type: Person
first name: Jeen
last name: Broekstra

Alexander Mädche
type: Person
first name: Alexander
last name: Mädche

Björn Schnizler
type: Person
first name: Björn
last name: Schnizler

Alberto Trombetta
type: Person
first name: Alberto
last name: Trombetta

Christine Parent
type: Person
first name: Christine
last name: Parent

R. Schmidt
type: Person
first name: R.
last name: Schmidt

York Sure
type: Person
first name: York
last name: Sure

M. Punceva
type: Person
first name: M.
last name: Punceva

I. V. Levenshtein
type: Person
first name: I. V.
last name: Levenshtein

Steffen Staab
type: Person
first name: Steffen
last name: Staab

Frank Boer
type: Person
first name: Frank
last name: Boer

Maarten Menken
type: Person
first name: Maarten
last name: Menken

Manfred Hauswirth
type: Person
first name: Manfred
last name: Hauswirth

Wiebe Hoek
type: Person
first name: Wiebe
last name: Hoek

Marc Ehrig
type: Person
first name: Marc
last name: Ehrig

Danilo Montesi
type: Person
first name: Danilo
last name: Montesi

Rogier Eijk
type: Person
first name: Rogier
last name: Eijk

Frank van Harmelen
type: Person
first name: Frank
last name: van Harmelen

Philippe Cudré-Mauroux
type: Person
first name: Philippe
last name: Cudré-Mauroux

Z. Despotovic
type: Person
first name: Z.
last name: Despotovic

Stefano Spaccapietra
type: Person
first name: Stefano
last name: Spaccapietra

Mike Papazoglou
type: Person
first name: Mike
last name: Papazoglou

Zahir Tari
type: Person
first name: Zahir
last name: Tari

A. Datta
type: Person
first name: A.
last name: Datta

Ateret Anaby-Tavor
type: Person
first name: Ateret
last name: Anaby-Tavor

Ronny Siebes
type: Person
first name: Ronny
last name: Siebes

Karl Aberer
type: Person
first name: Karl
last name: Aberer

Peter Mika
type: Person
first name: Peter
last name: Mika

Peter Haase
type: Person
first name: Peter
last name: Haase

Avigdor Gal
type: Person
first name: Avigdor
last name: Gal

Journal of Web Semantics
type: Periodical
acronym: JWS

Springer-Verlag
type: PublishingHouse
id: Springer-Verlag
coordinates: Directions
  town: Heidelberg
  country: DE

Cybernetics and Control Theory
type: Periodical
id: Cybernetics and Control Theory

The MIT Press
type: PublishingHouse
id: The MIT Press
coordinates: Directions
  town: Cambridge
  state: MA
  country: US

International journal of intelligent system
type: Periodical
id: International journal of intelligent system
acronym: IJIS

ACM SIGMOD Record
type: Periodical
id: ACM SIGMOD Record

VLDB Journal
type: Periodical
id: VLDB Journal

SemPGrid 04 Workshop
type: Congress
id: SemPGrid 04 Workshop
place: Directions
  town: New-York
  state: NY
  country: US
publishing date: Date
  month: --05
  year: 2004

13th Int. Conference on Knowledge Engineering and Management (EKAW-2002)
type: Congress
id: Int. Conference on Knowledge Engineering and Management
acronym: EKAW
issue: 13
publishing date: Date
  month: --10
  year: 2002

First European Semantic Web Symposium
type: Congress
id: European Semantic Web Symposium
acronym: ESWS
issue: 1
place: Directions
  town: Heraklion
  country: GR
publishing date: Date
  month: --05
  year: 2004

Proceedings of the SemPGrid 04 Workshop
type: ConferenceMinutes
heading: Proceedings of the SemPGrid 04 Workshop
publishing date: Date
  year: 2004
meeting: SemPGrid 04 Workshop

Bibster - A Semantics-Based Bibliographic Peer-to-Peer System
type: Communication
written by: Jeen Broekstra
written by: Marc Ehrig
written by: Peter Haase
written by: Frank van Harmelen
written by: Maarten Menken
written by: Peter Mika
written by: Björn Schnizler
written by: Ronny Siebes
in minutes: Proceedings of the SemPGrid 04 Workshop
heading: Bibster - A Semantics-Based Bibliographic Peer-to-Peer System

Measuring Similarity between Ontologies
type: Communication
written by: Alexander Mädche
written by: Steffen Staab
in minutes: Proc. Of the 13th Int. Conference on Knowledge Engineering and Management (EKAW-2002)
heading: Measuring Similarity between Ontologies

{P-Grid: A Self-organizing Structured P2P System}
type: JournalPaper
written by: Karl Aberer
written by: Philippe Cudré-Mauroux
written by: A. Datta
written by: Z. Despotovic
written by: Manfred Hauswirth
written by: M. Punceva
written by: R. Schmidt
in periodical: ACM SIGMOD Record
heading: {P-Grid}: A Self-organizing Structured P2P System
publishing date: Date
  year: 2003

Binary Codes capable of correcting deletions, insertions, and reversals
type: JournalPaper
written by: I. V. Levenshtein
in periodical: Cybernetics and Control Theory
heading: Binary Codes capable of correcting deletions, insertions, and reversals
publishing date: Date
  year: 1996

Database integration: the key to data interoperability
type: Extract
written by: Christine Parent
written by: Stefano Spaccapietra
in volume: Object-Oriented Data Modeling
heading: Database integration: the key to data interoperability
coordinated by: Stefano Spaccapietra
coordinated by: Mike Papazoglou
coordinated by: Zahir Tari

Proc. Of the 13th Int. Conference on Knowledge Engineering and Management (EKAW-2002)
type: ConferenceMinutes
published by: Springer-Verlag
heading: Proc. Of the 13th Int. Conference on Knowledge Engineering and Management (EKAW-2002)
meeting: 13th Int. Conference on Knowledge Engineering and Management (EKAW-2002)
publishing date: Date
  year: 2002

Proceedings of the First European Semantic Web Symposium
type: ConferenceMinutes
published by: Springer-Verlag
meeting: First European Semantic Web Symposium
heading: Proceedings of the First European Semantic Web Symposium
publishing date: Date
  year: 2004

{QOM} - Quick Ontology Mapping
type: Various
written by: Marc Ehrig
written by: Steffen Staab
heading: {QOM} - Quick Ontology Mapping
comment: submitted to the ISWC 04
publishing date: Date
  year: 2004

Ontology Mapping - An Integrated Approach
type: Communication
written by: Marc Ehrig
written by: York Sure
in minutes: Proceedings of the First European Semantic Web Symposium
heading: Ontology Mapping - An Integrated Approach
link: http://www.aifb.uni-karlsruhe.de/WBS/meh/publications/ehrig04ontology_ESWS04.pdf

Start making sense: The Chatty Web approach for global semantic agreements
type: JournalPaper
written by: Karl Aberer
written by: Philippe Cudré-Mauroux
written by: Manfred Hauswirth
in periodical: Journal of Web Semantics
heading: Start making sense: The Chatty Web approach for global semantic agreements
publishing date: Date
  month: --12
  year: 2003

Object-Oriented Data Modeling
type: Monography
published by: The MIT Press
heading: Object-Oriented Data Modeling
publishing date: Date
  year: 2000

On dynamically generated ontology translators in agent communication
type: JournalPaper
written by: Rogier Eijk
written by: Frank Boer
written by: Wiebe Hoek
written by: John-Jules Meyer
in periodical: International journal of intelligent system
heading: On dynamically generated ontology translators in agent communication
page range: PageInterval
  beginning: 587
  end: 607
publishing date: Date
  month: --12
  year: 2001

A Framework for Modeling and Evaluating Automatic Semantic Reconciliation
type: JournalPaper
written by: Avigdor Gal
written by: Ateret Anaby-Tavor
written by: Alberto Trombetta
written by: Danilo Montesi
in periodical: VLDB Journal
heading: A Framework for Modeling and Evaluating Automatic Semantic Reconciliation
comment: to appear
publishing date: Date
  year: 2004